Skip to content
VLSI

AMBA Protocol Interview Questions and Answers for VLSI Engineers

  • 9 min read

AMBA (Advanced Microcontroller Bus Architecture) is a family of interface specifications developed by Arm for communication between functional blocks in a system-on-chip (SoC). It allows processors, memory controllers, DMA engines, accelerators, and peripherals to exchange information using standardized transaction rules.

For RTL design and functional verification interviews, AXI, AHB, and APB are particularly important. Interviewers may ask you to compare these protocols, explain a transaction using a timing diagram, describe a VALID/READY handshake, or debug a transaction that never completes.

This article covers common AMBA protocol interview questions and answers, with practical examples and debugging scenarios to help freshers and verification engineers explain both the protocol concepts and their real-world applications.

1. What Is AMBA Protocol, and Why Is It Used?

AMBA provides standardized interfaces for communication between IP blocks in an SoC. These standards help design teams integrate reusable components without creating a completely different communication mechanism for every connection.

For example, a processor may use AXI to access high-bandwidth memory while communicating with a timer through an APB interface.

AMBA includes several protocol families and versions. AXI, AHB, and APB are common starting points for engineers learning SoC communication. The official Arm AMBA specifications are the primary reference for protocol-specific requirements.

2. What Is the Difference Between AXI, AHB, and APB?

Feature

AXI

AHB

APB

Main use

High-performance IP communication

Pipelined system/embedded communication

Simple peripheral access

Transfer structure

Separate read/write channels

Pipelined address and data phases

Setup and access phases

Burst transfers

Supported

Supported

Not intended for high-throughput bursts

Backpressure

VALID/READY handshakes

Transfer readiness and response controls

Wait states using signals such as PREADY in applicable versions

Typical example

Memory or accelerator interface

Embedded system bus

UART, GPIO, or timer registers

Example: A DMA engine transferring a large block of data may use AXI, while software configures the DMA control registers through a peripheral interface.

These protocols serve different purposes and can coexist within the same SoC.

3. What Are the Five Channels in AXI4?

AXI4 has five independent channels:

  • AW (Write Address): Transfers write-address information.
  • W (Write Data): Transfers write data and byte strobes.
  • B (Write Response): Returns the write response.
  • AR (Read Address): Transfers read-address information.
  • R (Read Data): Returns read data and response information.

The channels operate independently, so address acceptance, data transfer, and response handling do not necessarily occur in the same cycle.

Practical example: A master can have its write address accepted before the slave is ready to accept the associated write data. The verification environment must monitor the AW and W handshakes independently.

A common interview mistake is assuming that a write address and its data are always accepted together. AXI does not require that behavior.

4. Explain the AXI VALID/READY Handshake.

The VALID/READY handshake controls when information transfers on an AXI channel.

  • The source asserts VALID when the information is available.
  • The destination asserts READY when it can accept the information.
  • A transfer occurs at the active clock edge when both signals are high.

Example: If WVALID is high but WREADY remains low for three cycles, the write-data beat has not transferred. The source must retain the pending payload until the handshake occurs.

For RTL debugging, a transfer counter should generally advance on the accepted-transfer condition:

WVALID && WREADY

It should not advance simply because WVALID is high.

For further examples of common handshake errors, read InSkill’s Common AXI Design Mistakes and How to Avoid Them.

5. What Are AXI Burst Transfers?

AXI bursts associate multiple data beats with a transaction. AXI4 supports three main burst types:

  • FIXED: The address remains the same for each beat.
  • INCR: The address advances according to the transfer size.
  • WRAP: The address increments and wraps within a defined boundary.

The AxLEN field specifies the number of transfers minus one. For example, ARLEN = 3 represents four read data beats.

Example: A master reads four consecutive 32-bit words. An incrementing burst can transfer these words using one address transaction and four data beats, subject to the protocol’s address and boundary rules.

During verification, check the number of beats, address progression, data ordering, and final-beat indication. AXI4 bursts must also comply with the 4 KB address-boundary restriction.

6. What Is AXI4-Lite, and How Is It Different From AXI4?

AXI4-Lite is a simplified AXI interface commonly used for control and status register access.

Unlike full AXI4, AXI4-Lite supports single-beat transactions and omits features such as burst transfers and transaction IDs.

Example: A processor reads a peripheral's status register or writes a configuration value to a control register. AXI4-Lite is often suitable for this type of traffic.

In an interview, explain the intended use rather than saying AXI4-Lite is a completely separate protocol. It belongs to the AXI family but offers a reduced feature set.

7. What Is AHB Pipelining?

AHB (Advanced High-performance Bus) uses pipelined transfers with address and data phases. The address phase of one transfer can overlap with the data phase of an earlier transfer.

Important signals include HADDR, HTRANS, HWRITE, HREADY, and HRESP.

Example: While one transfer is completing its data phase, the bus can present the address for the next transfer. If a wait state occurs, the data phase may take additional cycles.

When debugging an AHB waveform, remember that the address and data visible during the same cycle can belong to different transfers. Tracking the pipeline stages is essential for interpreting the waveform correctly.

8. What Is the Difference Between AHB and AHB-Lite?

AHB-Lite is a simplified AHB variant designed for systems with a single bus master. It retains pipelined transfer behavior while reducing some of the complexity associated with multi-master systems.

The broader AHB architecture can support more complex system configurations, depending on the specification version.

Interview tip: First explain the address phase, data phase, pipelining, and wait-state behavior. Then describe the architectural differences. Also distinguish AHB-Lite from AHB5, which belongs to a later AMBA specification generation.

9. Explain the Phases of an APB Transfer.

APB (Advanced Peripheral Bus) is designed for relatively simple, low-bandwidth peripheral communication.

A basic APB transfer follows three phases:

  1. IDLE: No transfer is active.
  2. SETUP: The peripheral is selected and address/control information is presented.
  3. ACCESS: The enable signal is asserted and the transfer completes when the peripheral indicates readiness.

For APB versions that use PREADY, the peripheral can extend the access phase by keeping PREADY low.

Example: A processor writes a value to a timer register. The APB master selects the timer during setup, then asserts PENABLE during access. If the timer is not ready, the transfer waits until the peripheral signals completion.

Verification should check the sequence of states, address/control stability, and correct handling of wait states.

10. What Is an AXI-to-APB Bridge?

An AXI-to-APB bridge connects an AXI-based system to simpler APB peripherals. It translates transactions between the two interfaces.

For example, a processor may use AXI to access an interconnect, which routes peripheral accesses through an AXI-to-APB bridge to a UART or GPIO controller.

Verification should cover:

  • Address decoding and peripheral selection.
  • Correct read and write data.
  • AXI backpressure and response handling.
  • APB wait states.
  • Reset behavior and error handling where supported.

The bridge must preserve the intended transaction behavior even though AXI and APB use different transfer mechanisms.

11. How Would You Debug an AXI Transaction That Never Completes?

Begin by finding the last successful handshake and identifying the channel where progress stopped.

For a write transaction, inspect AW, W, and B. For a read transaction, inspect AR and R.

A practical debugging sequence is:

  1. Check whether the address was accepted.
  2. Confirm that data beats transferred using VALID and READY.
  3. Check the final-beat indication.
  4. Inspect response generation and response backpressure.
  5. Review internal counters, FIFO status, and state-machine transitions.
  6. Check reset behavior and transaction tracking.

Example: A slave accepts a write address and all write-data beats, but never returns a response. The waveform reveals that the internal beat counter increments on WVALID instead of WVALID && WREADY. If the counter advances incorrectly during backpressure, the transaction-completion logic may fail.

The fix should follow the protocol and design specification, followed by regression tests to confirm that other transactions still work.

12. What Should Verification Engineers Test for AMBA Protocols?

Protocol verification must cover normal traffic and difficult timing conditions.

For AXI, useful scenarios include:

  • Single-beat and burst transactions.
  • FIXED, INCR, and WRAP bursts where supported.
  • Backpressure on each channel.
  • Partial writes using WSTRB.
  • Delayed responses and outstanding transactions.
  • Reset during idle and active traffic.

For AHB, test transfer types, pipelining, wait states, and responses. For APB, test setup/access sequencing, peripheral selection, read/write behavior, and wait states.

Verification components can include drivers, monitors, scoreboards, assertions, and functional coverage. For example, an AXI assertion can check that a source holds VALID and its payload stable while waiting for READY, adapted to the specific channel and applicable protocol requirements.

13. What Is the Difference Between a Protocol and an Interconnect?

A protocol defines the rules for communication between interface endpoints. An interconnect connects multiple masters and subordinates and manages transaction routing.

For example, AXI specifies how IP blocks exchange addresses, data, and responses. An AXI interconnect can route transactions from a processor or DMA engine to the appropriate memory or peripheral interface.

Interconnect verification may involve address decoding, arbitration, routing, transaction ordering, and handling multiple active requests.

This distinction is particularly important for engineers preparing for SoC integration and subsystem verification roles.

14. How Should Freshers Prepare for AMBA Protocol Interviews?

Start with the purpose of AMBA and the roles of masters, subordinates, addresses, data, and control signals. Then learn APB transfers, AHB pipelining, and AXI's five channels and handshake behavior.

Next, practise drawing timing diagrams and tracing transactions cycle by cycle. Explain what happens when READY remains low, a burst reaches its final beat, or a response is delayed.

For verification roles, focus on assertions, monitors, scoreboards, functional coverage, and waveform debugging. For RTL roles, practise handshake logic, counters, state machines, and simple register interfaces.

InSkill’s AMBA AXI, AHB, APB Protocol and UVC Development Training covers protocol concepts, timing analysis, and verification-component development. For broader system-level context, explore VLSIGuru’s SoC Design and Verification Training and its VLSI Protocol Courses.

Conclusion

AMBA protocol interviews test whether you understand how transactions move through hardware interfaces, not just whether you can list signal names. Freshers should be able to explain AXI's channels and handshakes, burst transfers, AHB pipelining, APB access phases, and the role of bridges and interconnects.

The strongest answers combine protocol fundamentals with practical reasoning. Use timing diagrams, identify accepted handshakes, and explain how you would debug a stalled transaction. These skills provide a strong foundation for entry-level RTL design, SoC integration, and functional verification roles.

Share LinkedIn X WhatsApp